BDBM50326283 1-(beta-D-Glucopyranosyl)-4-methyl-3-(5-(4-fluorophenyl)-2-thiazolylmethyl)-benzene::CHEMBL1243274
SMILES Cc1cccc(O[C@@H]2O[C@H](CO)[C@@H](O)[C@H](O)[C@H]2O)c1Cc1ncc(s1)-c1ccc(F)cc1
InChI Key InChIKey=UADPSIDGAKAZOB-LDBVRRDLSA-N
Data  1 IC50
  Tab Delimited (TSV)   2D SDfile   Computed 3D by Vconf -m prep SDfile
Find this compound or compounds like it in BindingDB:
Activity Spreadsheet -- Enzyme Inhibition Constant Data from BindingDB
Found 1 hit for monomerid = 50326283
TargetSodium/glucose cotransporter 2(Homo sapiens (Human))
Mitsubishi Tanabe Pharma
Curated by ChEMBL
LigandPNGBDBM50326283(1-(beta-D-Glucopyranosyl)-4-methyl-3-(5-(4-fluorop...)
Affinity DataIC50:  8.10nM. Assay description: Inhibition of human SGLT2 expressed in CHO cells assessed as inhibition of [14C]-alpha-methyl-D-glucopyranoside uptake after 120 mins by liquid scint...
In DepthDetails ArticlePubMed