BDBM50326331 2-(biphenyl-4-yloxy)-5-chlorophenol::CHEMBL1243024
SMILES Oc1cc(Cl)ccc1Oc1ccc(cc1)-c1ccccc1
InChI Key InChIKey=ONKSSJSNIRVBIE-UHFFFAOYSA-N
Data  1 IC50
  Tab Delimited (TSV)   2D SDfile   Computed 3D by Vconf -m prep SDfile
Find this compound or compounds like it in BindingDB:
Activity Spreadsheet -- Enzyme Inhibition Constant Data from BindingDB
Found 1 hit for monomerid = 50326331
TargetEnoyl-acyl carrier reductase ENR(Toxoplasma gondii)
University Of Illinois At Chicago
Curated by ChEMBL
LigandPNGBDBM50326331(2-(biphenyl-4-yloxy)-5-chlorophenol | CHEMBL124302...)
Affinity DataIC50:  490nM. Assay description: Inhibition of Toxoplasma gondii enoyl reductase
In DepthDetails ArticlePubMed