BDBM50326390 (2S,4S)-1-({(2S,4S)-4-[2-(1,3-Dihydro-2H-isoindol-2-yl)-2-oxoethyl]-5-oxopyrrolidin-2-yl}carbonyl)-4-fluoropyrrolidine-2-carbonitrile::CHEMBL1243126
SMILES F[C@H]1C[C@@H](C#N)N(C1)C(=O)[C@@H]1C[C@@H](CC(=O)N2Cc3ccccc3C2)C(=O)N1
InChI Key InChIKey=UYJOKMDLJXDDNB-QAETUUGQSA-N
Data  8 IC50
  Tab Delimited (TSV)   2D SDfile   Computed 3D by Vconf -m prep SDfile
Find this compound or compounds like it in BindingDB:
Activity Spreadsheet -- Enzyme Inhibition Constant Data from BindingDB
Found 8 hits for monomerid = 50326390
TargetDipeptidyl peptidase 8(Homo sapiens (Human))
National Health Research Institutes
Curated by ChEMBL
LigandPNGBDBM50326390((2S,4S)-1-({(2S,4S)-4-[2-(1,3-Dihydro-2H-isoindol-...)
Affinity DataIC50: >1.00E+5nM. Assay description: Inhibition of human recombinant His-tagged DPP8 expressed in insect cells
In DepthDetails ArticlePubMed
TargetDipeptidyl peptidase 9(Homo sapiens (Human))
National Health Research Institutes
Curated by ChEMBL
LigandPNGBDBM50326390((2S,4S)-1-({(2S,4S)-4-[2-(1,3-Dihydro-2H-isoindol-...)
Affinity DataIC50: >5.00E+4nM. Assay description: Inhibition of human recombinant His-tagged DPP9 expressed in insect cells
In DepthDetails ArticlePubMed
TargetDipeptidyl peptidase 2(Homo sapiens (Human))
National Health Research Institutes
Curated by ChEMBL
LigandPNGBDBM50326390((2S,4S)-1-({(2S,4S)-4-[2-(1,3-Dihydro-2H-isoindol-...)
Affinity DataIC50: >1.00E+5nM. Assay description: Inhibition of human recombinant His-tagged DPP2 expressed in insect cells
In DepthDetails ArticlePubMed
TargetDipeptidyl peptidase 4(Homo sapiens (Human))
Mcgill University
Curated by ChEMBL
LigandPNGBDBM50326390((2S,4S)-1-({(2S,4S)-4-[2-(1,3-Dihydro-2H-isoindol-...)
Affinity DataIC50: >5.00E+4nM. Assay description: Inhibition of DPP4 (unknown origin)
In DepthDetails PubMed
TargetProlyl endopeptidase FAP(Homo sapiens (Human))
National Health Research Institutes
Curated by ChEMBL
LigandPNGBDBM50326390((2S,4S)-1-({(2S,4S)-4-[2-(1,3-Dihydro-2H-isoindol-...)
Affinity DataIC50:  20nM. Assay description: Inhibition of human recombinant FAP expressed in Hi5 insect cells
In DepthDetails ArticlePubMed
TargetAcyl-protein thioesterase 1(Rattus norvegicus)
Mcgill University
Curated by ChEMBL
LigandPNGBDBM50326390((2S,4S)-1-({(2S,4S)-4-[2-(1,3-Dihydro-2H-isoindol-...)
Affinity DataIC50:  20nM. Assay description: Inhibition of FAP (unknown origin)
In DepthDetails ArticlePubMed
TargetProlyl endopeptidase FAP(Homo sapiens (Human))
National Health Research Institutes
Curated by ChEMBL
LigandPNGBDBM50326390((2S,4S)-1-({(2S,4S)-4-[2-(1,3-Dihydro-2H-isoindol-...)
Affinity DataIC50:  20nM. Assay description: Inhibition of FAP (unknown origin)
In DepthDetails PubMed
TargetDipeptidyl peptidase 4(Homo sapiens (Human))
Mcgill University
Curated by ChEMBL
LigandPNGBDBM50326390((2S,4S)-1-({(2S,4S)-4-[2-(1,3-Dihydro-2H-isoindol-...)
Affinity DataIC50: >1.00E+5nM. Assay description: Inhibition of human recombinant His-tagged DPP4 expressed in insect cells
In DepthDetails ArticlePubMed