BDBM50326499 4, 4'-[[2-[[(4-(4-n-Hexyl)phenoxyphenyl)amino]carbonyl]-1, 4-phenylene]bis(methyleneoxy)]bis [a-oxobenzeneacetic acid]::CHEMBL1240791
SMILES CCCCCCc1ccc(Oc2ccc(NC(=O)c3cc(COc4ccc(cc4)C(=O)C(O)=O)ccc3COc3ccc(cc3)C(=O)C(O)=O)cc2)cc1
InChI Key InChIKey=BPNMNVUNRAEHAO-UHFFFAOYSA-N
Data  4 IC50
  Tab Delimited (TSV)   2D SDfile   Computed 3D by Vconf -m prep SDfile
Find this compound or compounds like it in BindingDB:
Activity Spreadsheet -- Enzyme Inhibition Constant Data from BindingDB
Found 4 hits for monomerid = 50326499
TargetProtein-tyrosine-phosphatase(Yersinia pestis)
Brown University
Curated by ChEMBL
LigandPNGBDBM50326499(4, 4'-[[2-[[(4-(4-n-Hexyl)phenoxyphenyl)amino]carb...)
Affinity DataIC50:  90nM. Assay description: Inhibition of Yersinia pestis YOpH
In DepthDetails ArticlePubMed
TargetTyrosine-protein phosphatase non-receptor type 7(Homo sapiens (Human))
Brown University
Curated by ChEMBL
LigandPNGBDBM50326499(4, 4'-[[2-[[(4-(4-n-Hexyl)phenoxyphenyl)amino]carb...)
Affinity DataIC50:  2.80E+4nM. Assay description: Inhibition of HePTP
In DepthDetails ArticlePubMed
TargetTyrosine-protein phosphatase non-receptor type 2(Homo sapiens (Human))
Brown University
Curated by ChEMBL
LigandPNGBDBM50326499(4, 4'-[[2-[[(4-(4-n-Hexyl)phenoxyphenyl)amino]carb...)
Affinity DataIC50:  2.30E+3nM. Assay description: Inhibition of TCPTP
In DepthDetails ArticlePubMed
TargetTyrosine-protein phosphatase non-receptor type 1(Homo sapiens (Human))
Brown University
Curated by ChEMBL
LigandPNGBDBM50326499(4, 4'-[[2-[[(4-(4-n-Hexyl)phenoxyphenyl)amino]carb...)
Affinity DataIC50:  1.20E+3nM. Assay description: Inhibition of PTP1B
In DepthDetails ArticlePubMed