BDBM50326567 CHEMBL1253544::ethyl 2-cyano-3-(2,4-dihydroxyphenyl)acrylate
SMILES CCOC(=O)C(=C\c1ccc(O)cc1O)\C#N
InChI Key InChIKey=WSGFIWLPAXMNQR-WEVVVXLNSA-N
Data  2 IC50
  Tab Delimited (TSV)   2D SDfile   Computed 3D by Vconf -m prep SDfile
Find this compound or compounds like it in BindingDB:
Activity Spreadsheet -- Enzyme Inhibition Constant Data from BindingDB
Found 2 hits for monomerid = 50326567
TargetMacrophage migration inhibitory factor(Homo sapiens (Human))
Brain Mind Institute
Curated by ChEMBL
LigandPNGBDBM50326567(CHEMBL1253544 | ethyl 2-cyano-3-(2,4-dihydroxyphen...)
Affinity DataIC50:  1.10E+5nM. Assay description: Inhibition of human MIF tautomerase activity in presence of Triton X-100 as detergent
In DepthDetails ArticlePubMed
TargetMacrophage migration inhibitory factor(Homo sapiens (Human))
Brain Mind Institute
Curated by ChEMBL
LigandPNGBDBM50326567(CHEMBL1253544 | ethyl 2-cyano-3-(2,4-dihydroxyphen...)
Affinity DataIC50:  6.21E+4nM. Assay description: Inhibition of human MIF tautomerase activity
In DepthDetails ArticlePubMed