BDBM50326752 (3S,3aR,4S,6S,6aR,7S,8S,9bS)-6-acetoxy-4-(butyryloxy)-3,3a-dihydroxy-3,6,9-trimethyl-7-(octanoyloxy)-2-oxo-2,3,3a,4,5,6,6a,7,8,9b-decahydroazuleno[4,5-b]furan-8-yl 4-methylbenzoate::CHEMBL1253595
SMILES CCCCCCCC(=O)O[C@@H]1[C@@H](OC(=O)c2ccc(C)cc2)C(C)=C2[C@@H]3OC(=O)[C@@](C)(O)[C@@]3(O)[C@H](C[C@](C)(OC(C)=O)[C@@H]12)OC(=O)CCC
InChI Key InChIKey=PFPDLIWWCKWAQA-UFHCJVJASA-N
Data  1 IC50
  Tab Delimited (TSV)   2D SDfile   Computed 3D by Vconf -m prep SDfile
Find this compound or compounds like it in BindingDB:
Activity Spreadsheet -- Enzyme Inhibition Constant Data from BindingDB
Found 1 hit for monomerid = 50326752
TargetSarcoplasmic/endoplasmic reticulum calcium ATPase 1(Oryctolagus cuniculus)
University Of Copenhagen
Curated by ChEMBL
LigandPNGBDBM50326752((3S,3aR,4S,6S,6aR,7S,8S,9bS)-6-acetoxy-4-(butyrylo...)
Affinity DataIC50:  44nM. Assay description: Inhibition of rabbit sarcoplasmic reticulum calcium ATPase by ATP regeneration assay
In DepthDetails ArticlePubMed