BDBM50326839 2-(biphenyl-2-ylmethyl)-6-methoxy-3,4-dihydronaphthalen-1(2H)-one::CHEMBL1253947
SMILES COc1ccc2C(=O)C(Cc3ccccc3-c3ccccc3)CCc2c1
InChI Key InChIKey=PYYMPYPIZNKUNB-UHFFFAOYSA-N
Data  1 IC50
  Tab Delimited (TSV)   2D SDfile   Computed 3D by Vconf -m prep SDfile
Find this compound or compounds like it in BindingDB:
Activity Spreadsheet -- Enzyme Inhibition Constant Data from BindingDB
Found 1 hit for monomerid = 50326839
Target1,25-dihydroxyvitamin D(3) 24-hydroxylase, mitochondrial(Homo sapiens (Human))
Cardiff University
Curated by ChEMBL
LigandPNGBDBM50326839(2-(biphenyl-2-ylmethyl)-6-methoxy-3,4-dihydronapht...)
Affinity DataIC50:  1.28E+5nM. Assay description: Inhibition of CYP24A1 expressed in CHO cells
In DepthDetails ArticlePubMed