BDBM50327241 2-(1-((1-(difluoromethyl)-2-oxo-1,2-dihydropyridin-4-yl)methyl)-5-methoxy-2-methyl-1H-indol-3-yl)acetic acid::CHEMBL1258960
SMILES COc1ccc2n(Cc3ccn(C(F)F)c(=O)c3)c(C)c(CC(O)=O)c2c1
InChI Key InChIKey=RNMRGHIWLVUBOE-UHFFFAOYSA-N
Data  2 IC50
  Tab Delimited (TSV)   2D SDfile   Computed 3D by Vconf -m prep SDfile
Find this compound or compounds like it in BindingDB:
Activity Spreadsheet -- Enzyme Inhibition Constant Data from BindingDB
Found 2 hits for monomerid = 50327241
TargetProstaglandin G/H synthase 2(Homo sapiens (Human))
University Of Alberta
Curated by ChEMBL
LigandPNGBDBM50327241(2-(1-((1-(difluoromethyl)-2-oxo-1,2-dihydropyridin...)
Affinity DataIC50:  3.10E+4nM. Assay description: Inhibition of human recombinant COX2 by enzyme immunoassay
In DepthDetails ArticlePubMed
TargetProstaglandin G/H synthase 1(Ovis aries (Sheep))
University Of Alberta
Curated by ChEMBL
LigandPNGBDBM50327241(2-(1-((1-(difluoromethyl)-2-oxo-1,2-dihydropyridin...)
Affinity DataIC50: >1.00E+5nM. Assay description: Inhibition of ovine COX1 by enzyme immunoassay
In DepthDetails ArticlePubMed