BDBM50327305 CHEMBL1258849::N,N-dimethyl-1-(4-(((2-phenyl-2H-1,2,3-triazol-4-yl)methylamino)methyl)phenyl)methanamine
SMILES CN(C)Cc1ccc(CNCc2cnn(n2)-c2ccccc2)cc1
InChI Key InChIKey=FNPQROHFDGOBPL-UHFFFAOYSA-N
Data  1 IC50
  Tab Delimited (TSV)   2D SDfile   Computed 3D by Vconf -m prep SDfile
Find this compound or compounds like it in BindingDB:
Activity Spreadsheet -- Enzyme Inhibition Constant Data from BindingDB
Found 1 hit for monomerid = 50327305
TargetLanosterol synthase(Homo sapiens (Human))
Institute Of Microbial Chemistry
Curated by ChEMBL
LigandPNGBDBM50327305(CHEMBL1258849 | N,N-dimethyl-1-(4-(((2-phenyl-2H-1...)
Affinity DataIC50:  1.41E+3nM. Assay description: Inhibition of OSC
In DepthDetails ArticlePubMed