BDBM50327580 7-methyl-6-(3-(4-(naphthalen-1-yl)piperazin-1-yl)propoxy)isoindolin-1-one::CHEMBL1257494
SMILES Cc1c2C(=O)NCc2ccc1OCCCN1CCN(CC1)c1cccc2ccccc12
InChI Key InChIKey=NYXWLYUNZBLYDF-UHFFFAOYSA-N
Data  4 KI
  Tab Delimited (TSV)   2D SDfile   Computed 3D by Vconf -m prep SDfile
Find this compound or compounds like it in BindingDB:
Activity Spreadsheet -- Enzyme Inhibition Constant Data from BindingDB
Found 4 hits for monomerid = 50327580
Target5-hydroxytryptamine receptor 1A(Homo sapiens (Human))
Pfizer
Curated by ChEMBL
LigandPNGBDBM50327580(7-methyl-6-(3-(4-(naphthalen-1-yl)piperazin-1-yl)p...)
Affinity DataKi:  0.615nM. Assay description: Binding affinity to human 5HT1A receptor expressed in HeLa cells by scintillation proximity assay
In DepthDetails ArticlePubMed
TargetD(2) dopamine receptor(Homo sapiens (Human))
Pfizer
Curated by ChEMBL
LigandPNGBDBM50327580(7-methyl-6-(3-(4-(naphthalen-1-yl)piperazin-1-yl)p...)
Affinity DataKi:  6.81nM. Assay description: Displacement of [3H]-Spiperone from human dopamine D2L receptor expressed in CHO cells
In DepthDetails ArticlePubMed
Target5-hydroxytryptamine receptor 2A(Homo sapiens (Human))
Pfizer
Curated by ChEMBL
LigandPNGBDBM50327580(7-methyl-6-(3-(4-(naphthalen-1-yl)piperazin-1-yl)p...)
Affinity DataKi:  9.43nM. Assay description: Binding affinity to human 5HT2A receptor
In DepthDetails ArticlePubMed
TargetSodium-dependent serotonin transporter(Homo sapiens (Human))
Pfizer
Curated by ChEMBL
LigandPNGBDBM50327580(7-methyl-6-(3-(4-(naphthalen-1-yl)piperazin-1-yl)p...)
Affinity DataKi:  194nM. Assay description: Displacement of [3H]-citalopram from human serotonin transporter expressed in HEK 293 cells by scintillation proximity assay
In DepthDetails ArticlePubMed