BDBM50327584 6-(4-(4-(6-fluoronaphthalen-1-yl)piperazin-1-yl)butoxy)-5-methylisoindolin-1-one::CHEMBL1258087
SMILES Cc1cc2CNC(=O)c2cc1OCCCCN1CCN(CC1)c1cccc2cc(F)ccc12
InChI Key InChIKey=MGUCYNMYMMBXDP-UHFFFAOYSA-N
Data  4 KI
  Tab Delimited (TSV)   2D SDfile   Computed 3D by Vconf -m prep SDfile
Find this compound or compounds like it in BindingDB:
Activity Spreadsheet -- Enzyme Inhibition Constant Data from BindingDB
Found 4 hits for monomerid = 50327584
TargetD(2) dopamine receptor(Homo sapiens (Human))
Pfizer
Curated by ChEMBL
LigandPNGBDBM50327584(6-(4-(4-(6-fluoronaphthalen-1-yl)piperazin-1-yl)bu...)
Affinity DataKi:  0.812nM. Assay description: Displacement of [3H]-Spiperone from human dopamine D2L receptor expressed in CHO cells
In DepthDetails ArticlePubMed
Target5-hydroxytryptamine receptor 1A(Homo sapiens (Human))
Pfizer
Curated by ChEMBL
LigandPNGBDBM50327584(6-(4-(4-(6-fluoronaphthalen-1-yl)piperazin-1-yl)bu...)
Affinity DataKi:  1.98nM. Assay description: Binding affinity to human 5HT1A receptor expressed in HeLa cells by scintillation proximity assay
In DepthDetails ArticlePubMed
TargetSodium-dependent serotonin transporter(Homo sapiens (Human))
Pfizer
Curated by ChEMBL
LigandPNGBDBM50327584(6-(4-(4-(6-fluoronaphthalen-1-yl)piperazin-1-yl)bu...)
Affinity DataKi:  8.81nM. Assay description: Displacement of [3H]-citalopram from human serotonin transporter expressed in HEK 293 cells by scintillation proximity assay
In DepthDetails ArticlePubMed
Target5-hydroxytryptamine receptor 2A(Homo sapiens (Human))
Pfizer
Curated by ChEMBL
LigandPNGBDBM50327584(6-(4-(4-(6-fluoronaphthalen-1-yl)piperazin-1-yl)bu...)
Affinity DataKi:  29.5nM. Assay description: Binding affinity to human 5HT2A receptor
In DepthDetails ArticlePubMed