BDBM50327613 6-(3-(4-(2,3-dihydro-1H-inden-4-yl)piperazin-1-yl)propoxy)isoindolin-1-one::CHEMBL1257262
SMILES O=C1NCc2ccc(OCCCN3CCN(CC3)c3cccc4CCCc34)cc12
InChI Key InChIKey=LJMGIPGFTXPVTB-UHFFFAOYSA-N
Data  3 KI
  Tab Delimited (TSV)   2D SDfile   Computed 3D by Vconf -m prep SDfile
Find this compound or compounds like it in BindingDB:
Activity Spreadsheet -- Enzyme Inhibition Constant Data from BindingDB
Found 3 hits for monomerid = 50327613
TargetD(2) dopamine receptor(Homo sapiens (Human))
Pfizer
Curated by ChEMBL
LigandPNGBDBM50327613(6-(3-(4-(2,3-dihydro-1H-inden-4-yl)piperazin-1-yl)...)
Affinity DataKi:  0.302nM. Assay description: Displacement of [3H]-Spiperone from human dopamine D2L receptor expressed in CHO cells
In DepthDetails ArticlePubMed
Target5-hydroxytryptamine receptor 2A(Homo sapiens (Human))
Pfizer
Curated by ChEMBL
LigandPNGBDBM50327613(6-(3-(4-(2,3-dihydro-1H-inden-4-yl)piperazin-1-yl)...)
Affinity DataKi:  3.16nM. Assay description: Binding affinity to human 5HT2A receptor
In DepthDetails ArticlePubMed
Target5-hydroxytryptamine receptor 1A(Homo sapiens (Human))
Pfizer
Curated by ChEMBL
LigandPNGBDBM50327613(6-(3-(4-(2,3-dihydro-1H-inden-4-yl)piperazin-1-yl)...)
Affinity DataKi: >4.04nM. Assay description: Binding affinity to human 5HT1A receptor expressed in HeLa cells by scintillation proximity assay
In DepthDetails ArticlePubMed