BDBM50327689 3-Fluoro-5-(2-(pyridin-2-yl)-6,7-dihydrooxazolo[5,4-c]pyridin-5(4H)-yl)benzonitrile::CHEMBL1257274
SMILES Fc1cc(cc(c1)N1CCc2nc(oc2C1)-c1ccccn1)C#N
InChI Key InChIKey=FZOHCTHIDYYEKU-UHFFFAOYSA-N
Data  1 IC50
  Tab Delimited (TSV)   2D SDfile   Computed 3D by Vconf -m prep SDfile
Find this compound or compounds like it in BindingDB:
Activity Spreadsheet -- Enzyme Inhibition Constant Data from BindingDB
Found 1 hit for monomerid = 50327689
TargetMetabotropic glutamate receptor 5(Homo sapiens (Human))
Sepracor
Curated by ChEMBL
LigandPNGBDBM50327689(3-Fluoro-5-(2-(pyridin-2-yl)-6,7-dihydrooxazolo[5,...)
Affinity DataIC50:  54nM. Assay description: Modulation of human recombinant mGluR5 expressed in CHO cells assessed as inhibition of glutamate-induced response
In DepthDetails ArticlePubMed