BDBM50327739 CHEMBL1257982::N-ethyl-N-((5-fluoro-1-(3-methylbut-2-enyl)-1H-indol-3-yl)methyl)ethanamine
SMILES [#6]-[#6]-[#7](-[#6]-[#6])-[#6]-c1cn(-[#6]\[#6]=[#6](\[#6])-[#6])c2ccc(F)cc12
InChI Key InChIKey=NLMVYAVSGYCVBC-UHFFFAOYSA-N
Data  1 IC50
  Tab Delimited (TSV)   2D SDfile   Computed 3D by Vconf -m prep SDfile
Find this compound or compounds like it in BindingDB:
Activity Spreadsheet -- Enzyme Inhibition Constant Data from BindingDB
Found 1 hit for monomerid = 50327739
TargetProtein-S-isoprenylcysteine O-methyltransferase(Homo sapiens (Human))
National University Of Singapore
Curated by ChEMBL
LigandPNGBDBM50327739(CHEMBL1257982 | N-ethyl-N-((5-fluoro-1-(3-methylbu...)
Affinity DataIC50:  3.50E+4nM. Assay description: Inhibition of recombinant ICMT expressed in Sf9 cells using [3H] AdoMet after 20 mins by scintillation counting
In DepthDetails ArticlePubMed