BDBM50327938 CHEMBL1257644::N-n-nonyl-7-methoxytacrine hydrochloride
SMILES CCCCCCCCCNc1c2CCCCc2nc2ccc(OC)cc12
InChI Key InChIKey=CMKNYPAMAODIKM-UHFFFAOYSA-N
Data  2 IC50
  Tab Delimited (TSV)   2D SDfile   Computed 3D by Vconf -m prep SDfile
Find this compound or compounds like it in BindingDB:
Activity Spreadsheet -- Enzyme Inhibition Constant Data from BindingDB
Found 2 hits for monomerid = 50327938
TargetCholinesterase(Homo sapiens (Human))
Charles University
Curated by ChEMBL
LigandPNGBDBM50327938(CHEMBL1257644 | N-n-nonyl-7-methoxytacrine hydroch...)
Affinity DataIC50:  360nM. Assay description: Inhibition of human plasmatic BChE after 5 mins
In DepthDetails ArticlePubMed
TargetAcetylcholinesterase(Homo sapiens (Human))
Charles University
Curated by ChEMBL
LigandPNGBDBM50327938(CHEMBL1257644 | N-n-nonyl-7-methoxytacrine hydroch...)
Affinity DataIC50:  1.60E+3nM. Assay description: Inhibition of human recombinant AChE after 5 mins
In DepthDetails ArticlePubMed