BDBM50328067 6-(1,1-dioxidothiomorpholin-4-yl)-N-(3-methoxyphenyl)-1-methyl-1H-pyrazolo[3,4-d]pyrimidin-4-amine::CHEMBL1234877::[6-(1,1-Dioxo-1lambda*6*-thiomorpholin-4-yl)-1-methyl-1H-pyrazolo[3,4-d]pyrimidin-4-yl]-(3-methoxy-phenyl)-amine
SMILES COc1cccc(Nc2nc(nc3n(C)ncc23)N2CCS(=O)(=O)CC2)c1
InChI Key InChIKey=IDYJWHSIWMIDKD-UHFFFAOYSA-N
Data  1 IC50
PDB links: 1 PDB ID matches this monomer.
  Tab Delimited (TSV)   2D SDfile   Computed 3D by Vconf -m prep SDfile
Find this compound or compounds like it in BindingDB:
Activity Spreadsheet -- Enzyme Inhibition Constant Data from BindingDB
Found 1 hit for monomerid = 50328067
LigandPNGBDBM50328067(6-(1,1-dioxidothiomorpholin-4-yl)-N-(3-methoxyphen...)
Affinity DataIC50:  75nM. Assay description: Inhibition of PI3Kalpha
In DepthDetails ArticlePubMed