BDBM50328110 2,2-Dimethyl-5-(4-methylpiperazin-1-yl)-N-(2-morpholin-4-ylethyl)-1,2,3,4-tetrahydropyrimidino[4',5':4,5]thieno[2,3-c]isoquinolin-8-amine::CHEMBL1258580
SMILES CN1CCN(CC1)c1nc2sc3c(NCCN4CCOCC4)ncnc3c2c2CC(C)(C)CCc12
InChI Key InChIKey=SIOHURHDOQDICY-UHFFFAOYSA-N
Data  1 IC50
  Tab Delimited (TSV)   2D SDfile   Computed 3D by Vconf -m prep SDfile
Find this compound or compounds like it in BindingDB:
Activity Spreadsheet -- Enzyme Inhibition Constant Data from BindingDB
Found 1 hit for monomerid = 50328110
TargetcAMP-specific 3',5'-cyclic phosphodiesterase 4B(Homo sapiens (Human))
RhôNe-Poulenc Rorer
Curated by ChEMBL
LigandPNGBDBM50328110(2,2-Dimethyl-5-(4-methylpiperazin-1-yl)-N-(2-morph...)
Affinity DataIC50:  95nM. Assay description: Inhibition of PDE4B1 expressed in yeast
In DepthDetails ArticlePubMed