BDBM50328134 2-(pyridin-3-ylmethyl)-N-(4-(trifluoromethoxy)phenyl)-2H-pyrazolo[3,4-d]pyrimidin-4-amine::CHEMBL1257194::US9670214, TABLE 10.31
SMILES FC(F)(F)Oc1ccc(Nc2ncnc3nn(Cc4cccnc4)cc23)cc1
InChI Key InChIKey=CDYRTKATRGHFFA-UHFFFAOYSA-N
Data  2 IC50  1 EC50
  Tab Delimited (TSV)   2D SDfile   Computed 3D by Vconf -m prep SDfile
Find this compound or compounds like it in BindingDB:
Activity Spreadsheet -- Enzyme Inhibition Constant Data from BindingDB
Found 3 hits for monomerid = 50328134
TargetBreakpoint cluster region protein/Tyrosine-protein kinase ABL1(Homo sapiens (Human))
Harvard Medical School
Curated by ChEMBL
LigandPNGBDBM50328134(2-(pyridin-3-ylmethyl)-N-(4-(trifluoromethoxy)phen...)
Affinity DataEC50:  1.70E+3nM. Assay description: Inhibition of Bcr-Abl in mouse BA/F3 cells
In DepthDetails ArticlePubMed
TargetNon-specific protein-tyrosine kinase [T818I](Homo sapiens (Human))
Dana-Farber Cancer Institute
US Patent
LigandPNGBDBM50328134(2-(pyridin-3-ylmethyl)-N-(4-(trifluoromethoxy)phen...)
Affinity DataIC50:  1.30E+3nMpH: 7.5Assay Description:In vitro kinase assays were carried out by using recombinant murine c-abl containing SH3, SH2 and kinase domains (residues 46-531) and full length im...
In DepthDetails US Patent
TargetNon-specific protein-tyrosine kinase(Homo sapiens (Human))
Dana-Farber Cancer Institute
US Patent
LigandPNGBDBM50328134(2-(pyridin-3-ylmethyl)-N-(4-(trifluoromethoxy)phen...)
Affinity DataIC50:  122nMpH: 7.5Assay Description:In vitro kinase assays were carried out by using recombinant murine c-abl containing SH3, SH2 and kinase domains (residues 46-531) and full length im...
In DepthDetails US Patent