BDBM50328167 CHEMBL1258359::N-(2-morpholinoethyl)-6-(4-(trifluoromethoxy)phenoxy)pyrimidin-4-amine
SMILES FC(F)(F)Oc1ccc(Oc2cc(NCCN3CCOCC3)ncn2)cc1
InChI Key InChIKey=YYEVWDURHZYYSH-UHFFFAOYSA-N
Data  1 EC50
  Tab Delimited (TSV)   2D SDfile   Computed 3D by Vconf -m prep SDfile
Find this compound or compounds like it in BindingDB:
Activity Spreadsheet -- Enzyme Inhibition Constant Data from BindingDB
Found 1 hit for monomerid = 50328167
TargetBreakpoint cluster region protein/Tyrosine-protein kinase ABL1(Homo sapiens (Human))
Harvard Medical School
Curated by ChEMBL
LigandPNGBDBM50328167(CHEMBL1258359 | N-(2-morpholinoethyl)-6-(4-(triflu...)
Affinity DataEC50: >1.00E+4nM. Assay description: Inhibition of Bcr-Abl in mouse BA/F3 cells
In DepthDetails ArticlePubMed