BDBM50328174 CHEMBL1258693::N2-(2-morpholinoethyl)-N4-(4-(trifluoromethoxy)phenyl)pyrimidine-2,4-diamine
SMILES FC(F)(F)Oc1ccc(Nc2ccnc(NCCN3CCOCC3)n2)cc1
InChI Key InChIKey=DOHAAWAGXKVTIX-UHFFFAOYSA-N
Data  1 EC50
  Tab Delimited (TSV)   2D SDfile   Computed 3D by Vconf -m prep SDfile
Find this compound or compounds like it in BindingDB:
Activity Spreadsheet -- Enzyme Inhibition Constant Data from BindingDB
Found 1 hit for monomerid = 50328174
TargetBreakpoint cluster region protein/Tyrosine-protein kinase ABL1(Homo sapiens (Human))
Harvard Medical School
Curated by ChEMBL
LigandPNGBDBM50328174(CHEMBL1258693 | N2-(2-morpholinoethyl)-N4-(4-(trif...)
Affinity DataEC50: >1.00E+4nM. Assay description: Inhibition of Bcr-Abl in mouse BA/F3 cells
In DepthDetails ArticlePubMed