BDBM50328225 3-(4-(5-(1,1,1,3,3,3-hexafluoro-2-hydroxypropan-2-yl)thiazol-2-yl)piperazin-1-yl)benzamide::CHEMBL1258820
SMILES NC(=O)c1cccc(c1)N1CCN(CC1)c1ncc(s1)C(O)(C(F)(F)F)C(F)(F)F
InChI Key InChIKey=MKIUMXKJOUBICH-UHFFFAOYSA-N
Data  1 IC50  1 EC50
  Tab Delimited (TSV)   2D SDfile   Computed 3D by Vconf -m prep SDfile
Find this compound or compounds like it in BindingDB:
Activity Spreadsheet -- Enzyme Inhibition Constant Data from BindingDB
Found 2 hits for monomerid = 50328225
TargetMalonyl-CoA decarboxylase, mitochondrial(Mus musculus)
Merck Research Laboratories
Curated by ChEMBL
LigandPNGBDBM50328225(3-(4-(5-(1,1,1,3,3,3-hexafluoro-2-hydroxypropan-2-...)
Affinity DataEC50:  1.40E+3nM. Assay description: Inhibition of MCD in mouse hepatocytes by whole cell assay
In DepthDetails ArticlePubMed
TargetMalonyl-CoA decarboxylase, mitochondrial(Homo sapiens (Human))
Merck Research Laboratories
Curated by ChEMBL
LigandPNGBDBM50328225(3-(4-(5-(1,1,1,3,3,3-hexafluoro-2-hydroxypropan-2-...)
Affinity DataIC50:  2.20nM. Assay description: Inhibition of human MCD
In DepthDetails ArticlePubMed