BDBM50328253 1,1,1,3,3,3-hexafluoro-2-(2-phenoxythiazol-5-yl)propan-2-ol::CHEMBL1258594
SMILES OC(c1cnc(Oc2ccccc2)s1)(C(F)(F)F)C(F)(F)F
InChI Key InChIKey=YIXVYNMOQWNXDE-UHFFFAOYSA-N
Data  1 IC50
  Tab Delimited (TSV)   2D SDfile   Computed 3D by Vconf -m prep SDfile
Find this compound or compounds like it in BindingDB:
Activity Spreadsheet -- Enzyme Inhibition Constant Data from BindingDB
Found 1 hit for monomerid = 50328253
TargetMalonyl-CoA decarboxylase, mitochondrial(Homo sapiens (Human))
Merck Research Laboratories
Curated by ChEMBL
LigandPNGBDBM50328253(1,1,1,3,3,3-hexafluoro-2-(2-phenoxythiazol-5-yl)pr...)
Affinity DataIC50:  450nM. Assay description: Inhibition of human MCD
In DepthDetails ArticlePubMed