BDBM50328264 5-(2-chlorophenyl)-3-isopropyl-7-nitro-2,10-dihydrobenzo[e]pyrazolo[4,3-b][1,4]diazepine::CHEMBL1258822
SMILES CC(C)c1n[nH]c2Nc3ccc(cc3C(=Nc12)c1ccccc1Cl)[N+]([O-])=O
InChI Key InChIKey=LTBGJBWIVOIOBU-UHFFFAOYSA-N
Data  1 IC50
  Tab Delimited (TSV)   2D SDfile   Computed 3D by Vconf -m prep SDfile
Find this compound or compounds like it in BindingDB:
Activity Spreadsheet -- Enzyme Inhibition Constant Data from BindingDB
Found 1 hit for monomerid = 50328264
TargetCyclin-dependent kinase 2/G1/S-specific cyclin-E1/G1/S-specific cyclin-E2(Homo sapiens (Human))
Hoffmann-La Roche
Curated by ChEMBL
LigandPNGBDBM50328264(5-(2-chlorophenyl)-3-isopropyl-7-nitro-2,10-dihydr...)
Affinity DataIC50:  10nM. Assay description: Inhibition of CDK2-cyclin E
In DepthDetails ArticlePubMed