BDBM50328665 (6aR,10aR)-3-[1-(4-Bromobutyl)cyclopentyl]-6,6a,7,8,10,10ahexahydro-1-hydroxy-6,6-dimethyl-9H-dibenzo[b,d]pyran-9-one::CHEMBL1259019
SMILES CC1(C)Oc2cc(cc(O)c2[C@@H]2CC(=O)CC[C@@H]12)C1(CCCCBr)CCCC1
InChI Key InChIKey=TVUHEVJRJRCHSF-RTBURBONSA-N
Data  2 KI
  Tab Delimited (TSV)   2D SDfile   Computed 3D by Vconf -m prep SDfile
Find this compound or compounds like it in BindingDB:
Activity Spreadsheet -- Enzyme Inhibition Constant Data from BindingDB
Found 2 hits for monomerid = 50328665
TargetCannabinoid receptor 1(Rattus norvegicus (rat))
Northeastern University
Curated by ChEMBL
LigandPNGBDBM50328665((6aR,10aR)-3-[1-(4-Bromobutyl)cyclopentyl]-6,6a,7,...)
Affinity DataKi:  13.1nM. Assay description: Displacement of [3H]CP55940 from rat brain CB1 receptor
In DepthDetails ArticlePubMed
TargetCannabinoid receptor 2(MOUSE)
Northeastern University
Curated by ChEMBL
LigandPNGBDBM50328665((6aR,10aR)-3-[1-(4-Bromobutyl)cyclopentyl]-6,6a,7,...)
Affinity DataKi:  13.9nM. Assay description: Displacement of [3H]CP55940 from mouse spleen CB2 receptor
In DepthDetails ArticlePubMed