BDBM50328972 CHEMBL1270174::N-((3S,6S)-6-(((R)-1-(3,5-bis(trifluoromethyl)phenyl)ethoxy)methyl)-6-phenylpiperidin-3-yl)propionamide
SMILES CCC(=O)N[C@H]1CC[C@](CO[C@H](C)c2cc(cc(c2)C(F)(F)F)C(F)(F)F)(NC1)c1ccccc1
InChI Key InChIKey=OVKFQKXVHAJHEJ-XORNHQRDSA-N
Data  1 KI
  Tab Delimited (TSV)   2D SDfile   Computed 3D by Vconf -m prep SDfile
Find this compound or compounds like it in BindingDB:
Activity Spreadsheet -- Enzyme Inhibition Constant Data from BindingDB
Found 1 hit for monomerid = 50328972
TargetSubstance-P receptor(Homo sapiens (Human))
Merck Research Laboratories
Curated by ChEMBL
LigandPNGBDBM50328972(CHEMBL1270174 | N-((3S,6S)-6-(((R)-1-(3,5-bis(trif...)
Affinity DataKi:  0.290nM. Assay description: Displacement of [3H]SAr-Met from human recombinant NK1 receptor expressed in CHO cells
In DepthDetails ArticlePubMed