BDBM50329009 (2-(3-fluoro-2-methylbenzyl)-6-(2-phenoxyethoxy)-1-phenyl-1H-indol-3-yl)(piperazin-1-yl)methanone::CHEMBL1269209
SMILES Cc1c(F)cccc1Cc1c(C(=O)N2CCNCC2)c2ccc(OCCOc3ccccc3)cc2n1-c1ccccc1
InChI Key InChIKey=VSKXHTKFUAQYIC-UHFFFAOYSA-N
Data  1 IC50
  Tab Delimited (TSV)   2D SDfile   Computed 3D by Vconf -m prep SDfile
Find this compound or compounds like it in BindingDB:
Activity Spreadsheet -- Enzyme Inhibition Constant Data from BindingDB
Found 1 hit for monomerid = 50329009
TargetRenin(Homo sapiens (Human))
Sanofi-Aventis Deutschland
Curated by ChEMBL
LigandPNGBDBM50329009((2-(3-fluoro-2-methylbenzyl)-6-(2-phenoxyethoxy)-1...)
Affinity DataIC50:  24nM. Assay description: Inhibition of human recombinant renin using flurorogenic substrate by microplate spectrofluorometer
In DepthDetails ArticlePubMed