BDBM50329019 (1,4-diazepan-1-yl)(2-phenoxy-1-phenyl-1H-indol-3-yl)methanone::CHEMBL1270873
SMILES O=C(N1CCCNCC1)c1c(Oc2ccccc2)n(-c2ccccc2)c2ccccc12
InChI Key InChIKey=HIHKIAUVGYPJEI-UHFFFAOYSA-N
Data  1 IC50
  Tab Delimited (TSV)   2D SDfile   Computed 3D by Vconf -m prep SDfile
Find this compound or compounds like it in BindingDB:
Activity Spreadsheet -- Enzyme Inhibition Constant Data from BindingDB
Found 1 hit for monomerid = 50329019
TargetRenin(Homo sapiens (Human))
Sanofi-Aventis Deutschland
Curated by ChEMBL
LigandPNGBDBM50329019((1,4-diazepan-1-yl)(2-phenoxy-1-phenyl-1H-indol-3-...)
Affinity DataIC50:  3.41E+3nM. Assay description: Inhibition of human recombinant renin using flurorogenic substrate by microplate spectrofluorometer
In DepthDetails ArticlePubMed