BDBM50329040 (1-phenyl-2-(m-tolyloxy)-1H-indol-3-yl)(piperazin-1-yl)methanone::CHEMBL1270275
SMILES Cc1cccc(Oc2c(C(=O)N3CCNCC3)c3ccccc3n2-c2ccccc2)c1
InChI Key InChIKey=CFEZUIYKUGSZFS-UHFFFAOYSA-N
Data  1 IC50
  Tab Delimited (TSV)   2D SDfile   Computed 3D by Vconf -m prep SDfile
Find this compound or compounds like it in BindingDB:
Activity Spreadsheet -- Enzyme Inhibition Constant Data from BindingDB
Found 1 hit for monomerid = 50329040
TargetRenin(Homo sapiens (Human))
Sanofi-Aventis Deutschland
Curated by ChEMBL
LigandPNGBDBM50329040((1-phenyl-2-(m-tolyloxy)-1H-indol-3-yl)(piperazin-...)
Affinity DataIC50:  773nM. Assay description: Inhibition of human recombinant renin using flurorogenic substrate by microplate spectrofluorometer
In DepthDetails ArticlePubMed