BDBM50329189 (3beta,18beta,20beta)-3-(Acetylamino)-11-oxo-olean-12-en-29-oicacid::CHEMBL1270093
SMILES CC(=O)N[C@H]1CC[C@@]2(C)[C@@H](CC[C@]3(C)[C@@H]2C(=O)C=C2[C@@H]4C[C@](C)(CC[C@]4(C)CC[C@@]32C)C(O)=O)C1(C)C
InChI Key InChIKey=OROFZAZESKXAEE-XWEVEMRCSA-N
Data  2 IC50
  Tab Delimited (TSV)   2D SDfile   Computed 3D by Vconf -m prep SDfile
Find this compound or compounds like it in BindingDB:
Activity Spreadsheet -- Enzyme Inhibition Constant Data from BindingDB
Found 2 hits for monomerid = 50329189
Target11-beta-hydroxysteroid dehydrogenase 1(Homo sapiens (Human))
University Of Natural Resources And Applied Life Sciences
Curated by ChEMBL
LigandPNGBDBM50329189((3beta,18beta,20beta)-3-(Acetylamino)-11-oxo-olean...)
Affinity DataIC50:  825nM. Assay description: Inhibition of human recombinant 11beta-HSD1 expressed in HEK293 cells assessed as conversion of [1,2-3H]-cortisone to cortisol by scintillation count...
In DepthDetails ArticlePubMed
Target11-beta-hydroxysteroid dehydrogenase type 2(Homo sapiens (Human))
University Of Natural Resources And Applied Life Sciences
Curated by ChEMBL
LigandPNGBDBM50329189((3beta,18beta,20beta)-3-(Acetylamino)-11-oxo-olean...)
Affinity DataIC50:  458nM. Assay description: Inhibition of human recombinant 11beta-HSD2 expressed in HEK293 cells assessed as conversion of [1,2,6,7-3H]-cortisol to cortisone by scintillation c...
In DepthDetails ArticlePubMed