BDBM50329323 4-(5-(Naphthalen-1-yl)-1,3,4-oxadiazol-2-ylthio)but-2-ynyl benzoate::CHEMBL1271011::LOX inhibitor, 24
SMILES O=C(OCC#CCSc1nnc(o1)-c1cccc2ccccc12)c1ccccc1
InChI Key InChIKey=ZANDCCMLBMLTSB-UHFFFAOYSA-N
Data  1 KI  4 IC50
  Tab Delimited (TSV)   2D SDfile   Computed 3D by Vconf -m prep SDfile
Find this compound or compounds like it in BindingDB:
Activity Spreadsheet -- Enzyme Inhibition Constant Data from BindingDB
Found 5 hits for monomerid = 50329323
TargetPolyunsaturated fatty acid lipoxygenase ALOX15(Homo sapiens (Human))
National Human Genome Research Institute
Curated by ChEMBL
LigandPNGBDBM50329323(4-(5-(Naphthalen-1-yl)-1,3,4-oxadiazol-2-ylthio)bu...)
Affinity DataKi: <10nM. Assay description: Inhibition of human N-terminal His6-tagged reticulocyte 15-lipoxygenase-1 after 15 mins by UV-vis spectrophotometer analysis
In DepthDetails ArticlePubMed
TargetPolyunsaturated fatty acid 5-lipoxygenase(Homo sapiens (Human))
National Human Genome Research Institute
Curated by ChEMBL
LigandPNGBDBM50329323(4-(5-(Naphthalen-1-yl)-1,3,4-oxadiazol-2-ylthio)bu...)
Affinity DataIC50: >2.00E+4nM. Assay description: Inhibition of human 5-lipoxygenase after 15 mins by UV-vis spectrophotometer analysis
In DepthDetails ArticlePubMed
TargetPolyunsaturated fatty acid lipoxygenase ALOX12(Homo sapiens (Human))
National Human Genome Research Institute
Curated by ChEMBL
LigandPNGBDBM50329323(4-(5-(Naphthalen-1-yl)-1,3,4-oxadiazol-2-ylthio)bu...)
Affinity DataIC50: >1.00E+5nM. Assay description: Inhibition of human N-terminal His6-tagged platelet 12-lipoxygenase after 15 mins by UV-vis spectrophotometer analysis
In DepthDetails ArticlePubMed
TargetArachidonate 15-lipoxygenase(Pseudomonas aeruginosa)
University Of California Santa Cruz
LigandPNGBDBM50329323(4-(5-(Naphthalen-1-yl)-1,3,4-oxadiazol-2-ylthio)bu...)
Affinity DataIC50:  10nMpH: 7.0 T: 2°C. Assay description: The one-point inhibition percentages were determined for human LOX inhibitors by following the formation of the conjugated diene product at 234 nm (&...
In DepthDetails ArticlePubMed
TargetPolyunsaturated fatty acid lipoxygenase ALOX15B(Homo sapiens (Human))
National Human Genome Research Institute
Curated by ChEMBL
LigandPNGBDBM50329323(4-(5-(Naphthalen-1-yl)-1,3,4-oxadiazol-2-ylthio)bu...)
Affinity DataIC50: >1.00E+5nM. Assay description: Inhibition of human N-terminal His6-tagged epithelial 15-lipoxygenase-2 after 15 mins by UV-vis spectrophotometer analysis
In DepthDetails ArticlePubMed