BDBM50329392 CHEMBL1269619::N-(4-Ethylphenyl)benzo[d]oxazol-2-amine
SMILES CCc1ccc(Nc2nc3ccccc3o2)cc1
InChI Key InChIKey=KKIDKWUGBUWNPR-UHFFFAOYSA-N
Data  1 IC50
  Tab Delimited (TSV)   2D SDfile   Computed 3D by Vconf -m prep SDfile
Find this compound or compounds like it in BindingDB:
Activity Spreadsheet -- Enzyme Inhibition Constant Data from BindingDB
Found 1 hit for monomerid = 50329392
TargetPolyunsaturated fatty acid 5-lipoxygenase(Mus musculus)
Ewha Womans University
Curated by ChEMBL
LigandPNGBDBM50329392(CHEMBL1269619 | N-(4-Ethylphenyl)benzo[d]oxazol-2-...)
Affinity DataIC50:  1.21E+3nM. Assay description: Inhibition of 5-lipoxygenase in BALB/c mouse BMMC assessed as LTC4 release after 20 mins by enzyme immunoassay
In DepthDetails ArticlePubMed