BDBM50329400 CHEMBL1269704::N-(3-Methoxyphenyl)-5-methylbenzo[d]oxazol-2-amine
SMILES COc1cccc(Nc2nc3cc(C)ccc3o2)c1
InChI Key InChIKey=NRLPEHVBZURFCW-UHFFFAOYSA-N
Data  1 IC50
  Tab Delimited (TSV)   2D SDfile   Computed 3D by Vconf -m prep SDfile
Find this compound or compounds like it in BindingDB:
Activity Spreadsheet -- Enzyme Inhibition Constant Data from BindingDB
Found 1 hit for monomerid = 50329400
TargetPolyunsaturated fatty acid 5-lipoxygenase(Mus musculus)
Ewha Womans University
Curated by ChEMBL
LigandPNGBDBM50329400(CHEMBL1269704 | N-(3-Methoxyphenyl)-5-methylbenzo[...)
Affinity DataIC50:  6.83E+3nM. Assay description: Inhibition of 5-lipoxygenase in BALB/c mouse BMMC assessed as LTC4 release after 20 mins by enzyme immunoassay
In DepthDetails ArticlePubMed