BDBM50329450 2-Methyl-5-pyridin-4-yl-1H-pyrrole-3-carboxamide::CHEMBL1269782
SMILES Cc1[nH]c(cc1C(N)=O)-c1ccncc1
InChI Key InChIKey=CHWPWHYRDCOVRG-UHFFFAOYSA-N
Data  1 IC50
  Tab Delimited (TSV)   2D SDfile   Computed 3D by Vconf -m prep SDfile
Find this compound or compounds like it in BindingDB:
Activity Spreadsheet -- Enzyme Inhibition Constant Data from BindingDB
Found 1 hit for monomerid = 50329450
TargetCell division cycle 7-related protein kinase(Homo sapiens (Human))
Nerviano Medical Sciences
Curated by ChEMBL
LigandPNGBDBM50329450(2-Methyl-5-pyridin-4-yl-1H-pyrrole-3-carboxamide |...)
Affinity DataIC50:  516nM. Assay description: Inhibition of Cdc7
In DepthDetails ArticlePubMed