BDBM50329452 5-(2-Amino-pyrimidin-4-yl)-2-naphthalen-1-yl-1H-pyrrole-3-carboxamide::CHEMBL1271128::US9670191, F5
SMILES NC(=O)c1cc([nH]c1-c1cccc2ccccc12)-c1ccnc(N)n1
InChI Key InChIKey=ZHMQRPXNGSXFBA-UHFFFAOYSA-N
Data  2 IC50
  Tab Delimited (TSV)   2D SDfile   Computed 3D by Vconf -m prep SDfile
Find this compound or compounds like it in BindingDB:
Activity Spreadsheet -- Enzyme Inhibition Constant Data from BindingDB
Found 2 hits for monomerid = 50329452
TargetCell division cycle 7-related protein kinase [58-574]/Protein DBF4 homolog A(Homo sapiens (Human))
Nerviano Medical Sciences
US Patent
LigandPNGBDBM50329452(5-(2-Amino-pyrimidin-4-yl)-2-naphthalen-1-yl-1H-py...)
Affinity DataIC50: <1.00E+3nM. Assay description: The assay consists of the transfer of radioactivity labeled phosphate moiety by the kinase to an acceptor substrate. The resulting 33P-labeled produc...
In DepthDetails US Patent
TargetCell division cycle 7-related protein kinase(Homo sapiens (Human))
Nerviano Medical Sciences
Curated by ChEMBL
LigandPNGBDBM50329452(5-(2-Amino-pyrimidin-4-yl)-2-naphthalen-1-yl-1H-py...)
Affinity DataIC50:  325nM. Assay description: Inhibition of Cdc7
In DepthDetails ArticlePubMed