BDBM50329501 CHEMBL1270332::N-{2-[4-(4-Iodobenzyl)-piperidin-1-ylmethyl]benoimidazol-5-yl}-methanesulfonamide
SMILES CS(=O)(=O)Nc1ccc2nc(CN3CCC(Cc4ccc(I)cc4)CC3)[nH]c2c1
InChI Key InChIKey=ZJNLXQGQBWLKIU-UHFFFAOYSA-N
Data  1 KI
  Tab Delimited (TSV)   2D SDfile   Computed 3D by Vconf -m prep SDfile
Find this compound or compounds like it in BindingDB:
Activity Spreadsheet -- Enzyme Inhibition Constant Data from BindingDB
Found 1 hit for monomerid = 50329501
TargetGlutamate receptor ionotropic, NMDA 2B(Rattus norvegicus (Rat))
Hamamatsu University School Of Medicine
Curated by ChEMBL
LigandPNGBDBM50329501(CHEMBL1270332 | N-{2-[4-(4-Iodobenzyl)-piperidin-1...)
Affinity DataKi:  5.75nM. Assay description: Displacement of [3H]ifenprodil from NR2B receptor in rat cortical synaptic membranes
In DepthDetails ArticlePubMed