BDBM50329782 (5R,6R,7S,8R,8aS)-3-(octylimino)hexahydro-1H-thiazolo[3,4-a]pyridine-5,6,7,8-tetraol::CHEMBL1271962
SMILES CCCCCCCC\N=C1/SC[C@@H]2[C@@H](O)[C@H](O)[C@@H](O)[C@@H](O)N12
InChI Key InChIKey=HXWFEIXEWVGTGU-QKCRKQBWSA-N
Data  1 KI
  Tab Delimited (TSV)   2D SDfile   Computed 3D by Vconf -m prep SDfile
Find this compound or compounds like it in BindingDB:
Activity Spreadsheet -- Enzyme Inhibition Constant Data from BindingDB
Found 1 hit for monomerid = 50329782
TargetLysosomal acid glucosylceramidase(Bos taurus)
Universidad De Sevilla
Curated by ChEMBL
LigandPNGBDBM50329782((5R,6R,7S,8R,8aS)-3-(octylimino)hexahydro-1H-thiaz...)
Affinity DataKi:  3.70E+3nM. Assay description: Inhibition of bovine liver beta-glucosidase after 10 to 30 mins
In DepthDetails ArticlePubMed