BDBM50329796 (Z)-3-((4-(N-(3-(dimethylamino)propyl)acetamido)phenylamino)(phenyl)methylene)-N-ethyl-N-methyl-2-oxoindoline-6-carboxamide::CHEMBL1271796
SMILES CCN(C)C(=O)c1ccc2C(C(=Nc3ccc(cc3)N(CCCN(C)C)C(C)=O)c3ccccc3)C(=O)Nc2c1
InChI Key InChIKey=JZOMCUFMJKGTSX-UHFFFAOYSA-N
Data  2 IC50  1 EC50
  Tab Delimited (TSV)   2D SDfile   Computed 3D by Vconf -m prep SDfile
Find this compound or compounds like it in BindingDB:
Activity Spreadsheet -- Enzyme Inhibition Constant Data from BindingDB
Found 3 hits for monomerid = 50329796
TargetTGF-beta receptor type-1(Homo sapiens (Human))
Boehringer Ingelheim Pharma
Curated by ChEMBL
LigandPNGBDBM50329796((Z)-3-((4-(N-(3-(dimethylamino)propyl)acetamido)ph...)
Affinity DataEC50:  411nM. Assay description: Inhibition of TGFbeta receptor in human HaCaT cells assessed as Smad phosphorylation by ELISA
In DepthDetails ArticlePubMed
TargetPlatelet-derived growth factor receptor alpha(Homo sapiens (Human))
Boehringer Ingelheim Pharma
Curated by ChEMBL
LigandPNGBDBM50329796((Z)-3-((4-(N-(3-(dimethylamino)propyl)acetamido)ph...)
Affinity DataIC50:  176nM. Assay description: Inhibition of PDGFRalpha
In DepthDetails ArticlePubMed
TargetTGF-beta receptor type-1(Homo sapiens (Human))
Boehringer Ingelheim Pharma
Curated by ChEMBL
LigandPNGBDBM50329796((Z)-3-((4-(N-(3-(dimethylamino)propyl)acetamido)ph...)
Affinity DataIC50:  9nM. Assay description: Inhibition of TGFbeta receptor
In DepthDetails ArticlePubMed