BDBM50329871 4-((carboxymethyl)(methyl)carbamoyl)-2-phenyl-1H-imidazole-5-carboxylic acid::CHEMBL1272087
SMILES CN(CC(O)=O)C(=O)c1nc([nH]c1C(O)=O)-c1ccccc1
InChI Key InChIKey=DBRISFFLQZGPSN-UHFFFAOYSA-N
Data  1 IC50
  Tab Delimited (TSV)   2D SDfile   Computed 3D by Vconf -m prep SDfile
Find this compound or compounds like it in BindingDB:
Activity Spreadsheet -- Enzyme Inhibition Constant Data from BindingDB
Found 1 hit for monomerid = 50329871
TargetPeptidyl-prolyl cis-trans isomerase NIMA-interacting 1(Homo sapiens (Human))
Vernalis (R&D)
Curated by ChEMBL
LigandPNGBDBM50329871(4-((carboxymethyl)(methyl)carbamoyl)-2-phenyl-1H-i...)
Affinity DataIC50:  9.40E+3nM. Assay description: Inhibition of Pin1 by PIn1 PPIase assay
In DepthDetails ArticlePubMed