BDBM50330041 (3-Bromophenyl)(3-bromothiophene)thiosemicarbazone::CHEMBL1269659
SMILES NC(=S)NN=C(c1sccc1Br)c1cccc(Br)c1
InChI Key InChIKey=USHGMXGGRQMWTI-UHFFFAOYSA-N
Data  2 IC50
  Tab Delimited (TSV)   2D SDfile   Computed 3D by Vconf -m prep SDfile
Find this compound or compounds like it in BindingDB:
Activity Spreadsheet -- Enzyme Inhibition Constant Data from BindingDB
Found 2 hits for monomerid = 50330041
TargetCathepsin B(Homo sapiens (Human))
Baylor University
Curated by ChEMBL
LigandPNGBDBM50330041((3-Bromophenyl)(3-bromothiophene)thiosemicarbazone...)
Affinity DataIC50: >1.00E+4nM. Assay description: Inhibition of human liver cathepsin B after 5 mins by microplate reader analysis
In DepthDetails ArticlePubMed
TargetProcathepsin L(Homo sapiens (Human))
Baylor University
Curated by ChEMBL
LigandPNGBDBM50330041((3-Bromophenyl)(3-bromothiophene)thiosemicarbazone...)
Affinity DataIC50:  370nM. Assay description: Inhibition of human liver cathepsin L after 5 mins by microplate reader analysis
In DepthDetails ArticlePubMed