BDBM50330421 CHEMBL1277272::N-(5-(thiophen-3-yl)-2,3-dihydro-1H-inden-2-yl)propane-2-sulfonamide
SMILES CC(C)S(=O)(=O)NC1Cc2ccc(cc2C1)-c1ccsc1
InChI Key InChIKey=XJNIQOCLXHHARK-UHFFFAOYSA-N
Data  1 EC50
  Tab Delimited (TSV)   2D SDfile   Computed 3D by Vconf -m prep SDfile
Find this compound or compounds like it in BindingDB:
Activity Spreadsheet -- Enzyme Inhibition Constant Data from BindingDB
Found 1 hit for monomerid = 50330421
TargetGlutamate receptor 2(Homo sapiens (Human))
Merck Research Laboratories
Curated by ChEMBL
LigandPNGBDBM50330421(CHEMBL1277272 | N-(5-(thiophen-3-yl)-2,3-dihydro-1...)
Affinity DataEC50:  1.00E+4nM. Assay description: Inhibition of human recombinant GluR2
In DepthDetails ArticlePubMed