BDBM50330439 2-[hydroxy(4-hydroxybutyl)amino]-2-oxoethyl dihydrogen phosphate::CHEMBL1236227::N-(4-hydroxybutyl)-phospho-glycolohydroxamic acid
SMILES OCCCCN(O)C(=O)COP(O)(O)=O
InChI Key InChIKey=XYJLIJWOOPZDNB-UHFFFAOYSA-N
Data  2 KI
PDB links: 1 PDB ID matches this monomer.
  Tab Delimited (TSV)   2D SDfile   Computed 3D by Vconf -m prep SDfile
Find this compound or compounds like it in BindingDB:
Activity Spreadsheet -- Enzyme Inhibition Constant Data from BindingDB
Found 2 hits for monomerid = 50330439
TargetFructose-bisphosphate aldolase(Candida albicans)
Paris-Sud University
Curated by ChEMBL
LigandPNGBDBM50330439(2-[hydroxy(4-hydroxybutyl)amino]-2-oxoethyl dihydr...)
Affinity DataKi:  297nM. Assay description: Inhibition of Candida albicans zinc dependent class 2 Fba
In DepthDetails ArticlePubMed
TargetFructose-bisphosphate aldolase(Candida albicans)
Paris-Sud University
Curated by ChEMBL
LigandPNGBDBM50330439(2-[hydroxy(4-hydroxybutyl)amino]-2-oxoethyl dihydr...)
Affinity DataKi:  300nM. Assay description: Inhibition of Candida albicans zinc dependent class 2 Fba
In DepthDetails ArticlePubMed