BDBM50330577 4-(3-amino-6-(3,4,5-trimethoxyphenyl)pyrazin-2-yl)-2-methylbenzoic acid::4-[3-amino-6-(3,4,5-trimethoxyphenyl)pyrazin-2-yl]-2-methylbenzoic acid::CHEMBL1230337
SMILES COc1cc(cc(OC)c1OC)-c1cnc(N)c(n1)-c1ccc(C(O)=O)c(C)c1
InChI Key InChIKey=AOAAZBKGFGSOFM-UHFFFAOYSA-N
Data  3 IC50
PDB links: 1 PDB ID matches this monomer.
  Tab Delimited (TSV)   2D SDfile   Computed 3D by Vconf -m prep SDfile
Find this compound or compounds like it in BindingDB:
Activity Spreadsheet -- Enzyme Inhibition Constant Data from BindingDB
Found 3 hits for monomerid = 50330577
TargetSerine/threonine-protein kinase Nek2(Homo sapiens (Human))
The Institute Of Cancer Research
Curated by ChEMBL
LigandPNGBDBM50330577(4-(3-amino-6-(3,4,5-trimethoxyphenyl)pyrazin-2-yl)...)
Affinity DataIC50:  2.60E+3nM. Assay description: Inhibition of NEK2 by microfluidic assay
TargetSerine/threonine-protein kinase Nek2(Homo sapiens (Human))
The Institute Of Cancer Research
Curated by ChEMBL
LigandPNGBDBM50330577(4-(3-amino-6-(3,4,5-trimethoxyphenyl)pyrazin-2-yl)...)
Affinity DataIC50:  1.20E+3nM. Assay description: Inhibition of NEK2 assessed as inhibition of substrate phosphorylation
TargetSerine/threonine-protein kinase Nek2(Homo sapiens (Human))
The Institute Of Cancer Research
Curated by ChEMBL
LigandPNGBDBM50330577(4-(3-amino-6-(3,4,5-trimethoxyphenyl)pyrazin-2-yl)...)
Affinity DataIC50:  2.30E+3nM. Assay description: Inhibition of NEK2 assessed as inhibition of substrate phosphorylation