BDBM50330591 (+/-)(3R,4R)-1-(3-amino-6-(3,4,5-trimethoxyphenyl)pyrazin-2-yl)-3-ethylpiperidine-4-carboxylic acid::(3R,4R)-1-[3-amino-6-(3,4,5-trimethoxyphenyl)pyrazin-2-yl]-3-ethylpiperidine-4-carboxylic acid::CHEMBL1230011
SMILES CC[C@H]1CN(CC[C@H]1C(O)=O)c1nc(cnc1N)-c1cc(OC)c(OC)c(OC)c1
InChI Key InChIKey=MQOJTCBESRAKQA-GXTWGEPZSA-N
Data  1 IC50
PDB links: 1 PDB ID matches this monomer.
  Tab Delimited (TSV)   2D SDfile   Computed 3D by Vconf -m prep SDfile
Find this compound or compounds like it in BindingDB:
Activity Spreadsheet -- Enzyme Inhibition Constant Data from BindingDB
Found 1 hit for monomerid = 50330591
TargetSerine/threonine-protein kinase Nek2(Homo sapiens (Human))
The Institute Of Cancer Research
Curated by ChEMBL
LigandPNGBDBM50330591((+/-)(3R,4R)-1-(3-amino-6-(3,4,5-trimethoxyphenyl)...)
Affinity DataIC50:  1.50E+3nM. Assay description: Inhibition of NEK2 by microfluidic assay