BDBM50330604 1-(3-amino-6-(3-cyclopropylthiophen-2-yl)pyrazin-2-yl)piperidine-4-carboxylic acid::CHEMBL1277020
SMILES Nc1ncc(nc1N1CCC(CC1)C(O)=O)-c1sccc1C1CC1
InChI Key InChIKey=FDOMHNLRAUEUHV-UHFFFAOYSA-N
Data  1 IC50
  Tab Delimited (TSV)   2D SDfile   Computed 3D by Vconf -m prep SDfile
Find this compound or compounds like it in BindingDB:
Activity Spreadsheet -- Enzyme Inhibition Constant Data from BindingDB
Found 1 hit for monomerid = 50330604
TargetSerine/threonine-protein kinase Nek2(Homo sapiens (Human))
The Institute Of Cancer Research
Curated by ChEMBL
LigandPNGBDBM50330604(1-(3-amino-6-(3-cyclopropylthiophen-2-yl)pyrazin-2...)
Affinity DataIC50:  1.60E+3nM. Assay description: Inhibition of NEK2 by microfluidic assay
In DepthDetails ArticlePubMed