BDBM50330607 1-(3-amino-6-(3,4-dimethoxyphenyl)pyrazin-2-yl)piperidine-4-carboxylic acid::CHEMBL1277200
SMILES COc1ccc(cc1OC)-c1cnc(N)c(n1)N1CCC(CC1)C(O)=O
InChI Key InChIKey=NZBMFJQUUWNHFH-UHFFFAOYSA-N
Data  1 IC50
  Tab Delimited (TSV)   2D SDfile   Computed 3D by Vconf -m prep SDfile
Find this compound or compounds like it in BindingDB:
Activity Spreadsheet -- Enzyme Inhibition Constant Data from BindingDB
Found 1 hit for monomerid = 50330607
TargetSerine/threonine-protein kinase Nek2(Homo sapiens (Human))
The Institute Of Cancer Research
Curated by ChEMBL
LigandPNGBDBM50330607(1-(3-amino-6-(3,4-dimethoxyphenyl)pyrazin-2-yl)pip...)
Affinity DataIC50:  1.90E+3nM. Assay description: Inhibition of NEK2 by microfluidic assay
In DepthDetails ArticlePubMed