BDBM50330741 2-(2-chlorophenyl)-4-((methyl(phenyl)amino)methyl)-5-(2-(pyridin-2-yl)ethyl)-1H-pyrazolo[4,3-c]pyridine-3,6(2H,5H)-dione::CHEMBL1277768
SMILES CN(Cc1n(CCc2ccccn2)c(=O)cc2[nH]n(-c3ccccc3Cl)c(=O)c12)c1ccccc1
InChI Key InChIKey=NTNUCNNNZOVXED-UHFFFAOYSA-N
Data  1 KI
  Tab Delimited (TSV)   2D SDfile   Computed 3D by Vconf -m prep SDfile
Find this compound or compounds like it in BindingDB:
Activity Spreadsheet -- Enzyme Inhibition Constant Data from BindingDB
Found 1 hit for monomerid = 50330741
TargetNADPH oxidase 4(Homo sapiens (Human))
Genkyotex
Curated by ChEMBL
LigandPNGBDBM50330741(2-(2-chlorophenyl)-4-((methyl(phenyl)amino)methyl)...)
Affinity DataKi:  172nM. Assay description: Inhibition of human NOX4 overexpressed in human PMN cell membrane assessed as ROS production by cell free assay in presence of NADPH
In DepthDetails ArticlePubMed