BDBM50330795 2-hydroxy-5-isopropyl-2,4,6-cycloheptatrien-1-one::CHEMBL1275999
SMILES CC(C)c1ccc(O)c(=O)cc1
InChI Key InChIKey=WKEWHSLZDDZONF-UHFFFAOYSA-N
Data  1 KI  7 IC50
  Tab Delimited (TSV)   2D SDfile   Computed 3D by Vconf -m prep SDfile
Find this compound or compounds like it in BindingDB:
Activity Spreadsheet -- Enzyme Inhibition Constant Data from BindingDB
Found 8 hits for monomerid = 50330795
TargetPolyphenol oxidase 2(Agaricus bisporus (Common mushroom))
Institute For Theoretical Medicine
Curated by ChEMBL
LigandPNGBDBM50330795(2-hydroxy-5-isopropyl-2,4,6-cycloheptatrien-1-one ...)
Affinity DataKi:  20nM. Assay description: Competitive inhibition of mushroom tyrosinase after 15 mins by Lineweaver-Bulk plot analysis
In DepthDetails ArticlePubMed
TargetTyrosinase(Homo sapiens (Human))
Institute For Theoretical Medicine
Curated by ChEMBL
LigandPNGBDBM50330795(2-hydroxy-5-isopropyl-2,4,6-cycloheptatrien-1-one ...)
Affinity DataIC50:  1.15E+3nM. Assay description: Competitive inhibition of tyrosinase in human G-361 cells incubated for 10 mins measured for 2 hrs by MBTH-based spectrophotometry
In DepthDetails ArticlePubMed
TargetPolyphenol oxidase 2(Agaricus bisporus (Common mushroom))
Institute For Theoretical Medicine
Curated by ChEMBL
LigandPNGBDBM50330795(2-hydroxy-5-isopropyl-2,4,6-cycloheptatrien-1-one ...)
Affinity DataIC50:  70nM. Assay description: Inhibition of mushroom tyrosinase after 15 mins
In DepthDetails ArticlePubMed
TargetTyrosinase(Homo sapiens (Human))
Institute For Theoretical Medicine
Curated by ChEMBL
LigandPNGBDBM50330795(2-hydroxy-5-isopropyl-2,4,6-cycloheptatrien-1-one ...)
Affinity DataIC50:  1.15E+3nM. Assay description: Inhibition of human tyrosinase
In DepthDetails ArticlePubMed
TargetPolyphenol oxidase 2(Agaricus bisporus (Common mushroom))
Institute For Theoretical Medicine
Curated by ChEMBL
LigandPNGBDBM50330795(2-hydroxy-5-isopropyl-2,4,6-cycloheptatrien-1-one ...)
Affinity DataIC50:  70nM. Assay description: Inhibition of mushroom tyrosinase
In DepthDetails ArticlePubMed
TargetPolyphenol oxidase 2(Agaricus bisporus (Common mushroom))
Institute For Theoretical Medicine
Curated by ChEMBL
LigandPNGBDBM50330795(2-hydroxy-5-isopropyl-2,4,6-cycloheptatrien-1-one ...)
Affinity DataIC50:  70nM. Assay description: Inhibition of mushroom tyrosinase
In DepthDetails ArticlePubMed
TargetTyrosinase(Homo sapiens (Human))
Institute For Theoretical Medicine
Curated by ChEMBL
LigandPNGBDBM50330795(2-hydroxy-5-isopropyl-2,4,6-cycloheptatrien-1-one ...)
Affinity DataIC50:  1.15E+3nM. Assay description: Inhibition of human tyrosinase
In DepthDetails ArticlePubMed
TargetPolyphenol oxidase 2(Agaricus bisporus (Common mushroom))
Institute For Theoretical Medicine
Curated by ChEMBL
LigandPNGBDBM50330795(2-hydroxy-5-isopropyl-2,4,6-cycloheptatrien-1-one ...)
Affinity DataIC50:  70nM. Assay description: Non-competitive inhibition of mushroom tyrosinase
In DepthDetails ArticlePubMed