BDBM50330830 3-(3-(phenethylamino)cyclopentyl)-1H-indole-5-carbonitrile::CHEMBL1276960
SMILES N#Cc1ccc2[nH]cc(C3CCC(C3)NCCc3ccccc3)c2c1
InChI Key InChIKey=BEWBVHFXPZGUFG-UHFFFAOYSA-N
Data  1 IC50
  Tab Delimited (TSV)   2D SDfile   Computed 3D by Vconf -m prep SDfile
Find this compound or compounds like it in BindingDB:
Activity Spreadsheet -- Enzyme Inhibition Constant Data from BindingDB
Found 1 hit for monomerid = 50330830
TargetSodium-dependent serotonin transporter(Homo sapiens (Human))
Bristol-Myers Squibb
Curated by ChEMBL
LigandPNGBDBM50330830(3-(3-(phenethylamino)cyclopentyl)-1H-indole-5-carb...)
Affinity DataIC50:  10nM. Assay description: Binding affinity to human SERT
In DepthDetails ArticlePubMed