BDBM50330846 CHEMBL1275792::[(1S,3S)-3-(5-Fluoro-1H-indol-3-yl)-cyclopentyl]-dimethylamine
SMILES CN(C)[C@H]1CC[C@@H](C1)c1c[nH]c2ccc(F)cc12
InChI Key InChIKey=LRSVJJWABVMKRA-JQWIXIFHSA-N
Data  1 IC50
  Tab Delimited (TSV)   2D SDfile   Computed 3D by Vconf -m prep SDfile
Find this compound or compounds like it in BindingDB:
Activity Spreadsheet -- Enzyme Inhibition Constant Data from BindingDB
Found 1 hit for monomerid = 50330846
TargetSodium-dependent serotonin transporter(Homo sapiens (Human))
Bristol-Myers Squibb
Curated by ChEMBL
LigandPNGBDBM50330846(CHEMBL1275792 | [(1S,3S)-3-(5-Fluoro-1H-indol-3-yl...)
Affinity DataIC50:  5.90nM. Assay description: Binding affinity to human SERT
In DepthDetails ArticlePubMed