BDBM50330873 CHEMBL1277786::US9090589, 4::trans rac-N1-(4-((6-amino-4-methylpyridin-2-yl)methyl)pyrrolidin-3-yl)-N2-phenethylethane-1,2-diamine
SMILES Cc1cc(N)nc(C[C@H]2CNC[C@@H]2NCCNCCc2ccccc2)c1
InChI Key InChIKey=OOOHDCHGOXCPHM-ICSRJNTNSA-N
Data  6 KI
  Tab Delimited (TSV)   2D SDfile   Computed 3D by Vconf -m prep SDfile
Find this compound or compounds like it in BindingDB:
Activity Spreadsheet -- Enzyme Inhibition Constant Data from BindingDB
Found 6 hits for monomerid = 50330873
TargetNitric oxide synthase, inducible(Mus musculus (mouse))
Northwestern University
Curated by ChEMBL
LigandPNGBDBM50330873(CHEMBL1277786 | US9090589, 4 | trans rac-N1-(4-((6...)
Affinity DataKi:  88nM. Assay description: Inhibition of mouse recombinant iNOS
In DepthDetails ArticlePubMed
TargetNitric oxide synthase, brain(Homo sapiens (Human))
Northwestern University
US Patent
LigandPNGBDBM50330873(CHEMBL1277786 | US9090589, 4 | trans rac-N1-(4-((6...)
Affinity DataKi:  880nM. Assay description: Recombinant NOS isozymes over-expressed in E. coli were utilized. (Ji, H., et al., Discovery of highly potent and selective inhibitors of neuronal ni...
In DepthDetails US Patent
TargetNitric oxide synthase, brain(Rattus norvegicus (rat))
Northwestern University
Curated by ChEMBL
LigandPNGBDBM50330873(CHEMBL1277786 | US9090589, 4 | trans rac-N1-(4-((6...)
Affinity DataKi:  1.82E+4nM. Assay description: Inhibition of rat recombinant nNOS
In DepthDetails ArticlePubMed
TargetNitric oxide synthase, inducible(Homo sapiens (Human))
Northwestern University
US Patent
LigandPNGBDBM50330873(CHEMBL1277786 | US9090589, 4 | trans rac-N1-(4-((6...)
Affinity DataKi:  1.82E+4nM. Assay description: Recombinant NOS isozymes over-expressed in E. coli were utilized. (Ji, H., et al., Discovery of highly potent and selective inhibitors of neuronal ni...
In DepthDetails US Patent
TargetNitric oxide synthase, endothelial(Bos taurus (bovine))
Northwestern University
Curated by ChEMBL
LigandPNGBDBM50330873(CHEMBL1277786 | US9090589, 4 | trans rac-N1-(4-((6...)
Affinity DataKi:  1.24E+5nM. Assay description: Inhibition of bovine recombinant eNOS
In DepthDetails ArticlePubMed
TargetNitric oxide synthase, endothelial(Homo sapiens (Human))
Northwestern University
US Patent
LigandPNGBDBM50330873(CHEMBL1277786 | US9090589, 4 | trans rac-N1-(4-((6...)
Affinity DataKi:  1.24E+5nM. Assay description: Recombinant NOS isozymes over-expressed in E. coli were utilized. (Ji, H., et al., Discovery of highly potent and selective inhibitors of neuronal ni...
In DepthDetails US Patent